# -rw-r--r-- 1.1 KiB View raw
                                                                                
1
2
3
4
5
6
7
8
9
10
11
12
13
14
15
16
tools/image-host.c:17:10: fatal error: openssl/pem.h: No such file or directory
   17 | #include <openssl/pem.h>
      |          ^~~~~~~~~~~~~~~
compilation terminated.
make[1]: *** [scripts/Makefile.host:112: tools/image-host.o] Error 1
make[1]: *** Waiting for unfinished jobs....
  WRAP    tools/boot/image.c
make: *** [Makefile:1906: tools] Error 2
error: in phase 'build': uncaught exception:
%exception #<&invoke-error program: "make" arguments: ("-j" "8" "HOSTCC=gcc" "CROSS_COMPILE=aarch64-linux-gnu-") exit-status: 2 term-signal: #f stop-signal: #f> 
phase `build' failed after 10.3 seconds
command "make" "-j" "8" "HOSTCC=gcc" "CROSS_COMPILE=aarch64-linux-gnu-" failed with status 2
builder for `/gnu/store/648maq152gn4v17sd4fiyyzb0ahbx8wm-u-boot-pinebook-2022.04.drv' failed with exit code 1
build of /gnu/store/648maq152gn4v17sd4fiyyzb0ahbx8wm-u-boot-pinebook-2022.04.drv failed
View build log at '/var/log/guix/drvs/64/8maq152gn4v17sd4fiyyzb0ahbx8wm-u-boot-pinebook-2022.04.drv.gz'.
guix build: error: build of `/gnu/store/648maq152gn4v17sd4fiyyzb0ahbx8wm-u-boot-pinebook-2022.04.drv' failed